Last name,Given name/s,Notes,Prison no ,Start Year,End Year,Page,QSA Ref,Item ID,Digital Image ID,Digital Image ID Source,Series ID,M/film no ,Index name,Description,Source,
ABBOTT,Henry,,2223,1863,1867,135,PRI2/9,ITM92280,DR56517,https://www.archivessearch.qld.gov.au/api/download_file/DR56517,S15398,Z2040,St Helena prisoners 1863-1936,Names of all prisoners who were held at St Helena Penal Establishment,http://www.archivessearch.qld.gov.au/Search/ItemDetails.aspx?ItemId=92280,
ABBOTT,Thomas Kingswell Lefray,,4565,1895,1900,356,PRI2/8,ITM92278,DR64930,https://www.archivessearch.qld.gov.au/api/download_file/DR64930,S15403,Z2039,St Helena prisoners 1863-1936,Names of all prisoners who were held at St Helena Penal Establishment,http://www.archivessearch.qld.gov.au/Search/ItemDetails.aspx?ItemId=92278,
ABDALLAH,,or Charley ROBERTS,4008,1879,1895,398,PRI2/7,ITM92277,DR69473,https://www.archivessearch.qld.gov.au/api/download_file/DR69473,S15403,Z2039,St Helena prisoners 1863-1936,Names of all prisoners who were held at St Helena Penal Establishment,http://www.archivessearch.qld.gov.au/Search/ItemDetails.aspx?ItemId=92277,
ABDIE,,,2820,1879,1895,8,PRI2/7,ITM92277,DR69471,https://www.archivessearch.qld.gov.au/api/download_file/DR69471,S15403,Z2039,St Helena prisoners 1863-1936,Names of all prisoners who were held at St Helena Penal Establishment,http://www.archivessearch.qld.gov.au/Search/ItemDetails.aspx?ItemId=92277,
ABDUL,,or DARER,3915,1879,1895,305,PRI2/7,ITM92277,DR69472,https://www.archivessearch.qld.gov.au/api/download_file/DR69472,S15403,Z2039,St Helena prisoners 1863-1936,Names of all prisoners who were held at St Helena Penal Establishment,http://www.archivessearch.qld.gov.au/Search/ItemDetails.aspx?ItemId=92277,
A'BECKETT,James,,4236,1895,1900,22,PRI2/8,ITM92278,DR23440,https://www.archivessearch.qld.gov.au/api/download_file/DR23440,S15403,Z2039,St Helena prisoners 1863-1936,Names of all prisoners who were held at St Helena Penal Establishment,http://www.archivessearch.qld.gov.au/Search/ItemDetails.aspx?ItemId=92278,
A'BECKETT,,or James MURPHY,5290,1887,1907,493,A/18577,ITM271423,DR69559,https://www.archivessearch.qld.gov.au/api/download_file/DR69459,S15403,Z2040,St Helena prisoners 1863-1936,Names of all prisoners who were held at St Helena Penal Establishment,http://www.archivessearch.qld.gov.au/Search/ItemDetails.aspx?ItemId=271423,
ABEL,George,,485,1863,1867,38,PRI2/9,ITM92280,DR56516,https://www.archivessearch.qld.gov.au/api/download_file/DR56516,S15398,Z2040,St Helena prisoners 1863-1936,Names of all prisoners who were held at St Helena Penal Establishment,http://www.archivessearch.qld.gov.au/Search/ItemDetails.aspx?ItemId=92280,
ABEL,Henry,,2269,1863,1867,137,PRI2/9,ITM92280,DR56517,https://www.archivessearch.qld.gov.au/api/download_file/DR56517,S15398,Z2040,St Helena prisoners 1863-1936,Names of all prisoners who were held at St Helena Penal Establishment,http://www.archivessearch.qld.gov.au/Search/ItemDetails.aspx?ItemId=92280,
ABRAHAMS,William Thomas,,456,1935,1935,86,A/18565,ITM341020,DR60491,https://www.archivessearch.qld.gov.au/api/download_file/DR60491,S10832,87111,St Helena prisoners 1863-1936,Names of all prisoners who were held at St Helena Penal Establishment,http://www.archivessearch.qld.gov.au/Search/ItemDetails.aspx?ItemId=341020,
ABRAHAMS,William Thomas,,475,1935,1935,88,A/18565,ITM341020,DR60491,https://www.archivessearch.qld.gov.au/api/download_file/DR60491,S10832,87111,St Helena prisoners 1863-1936,Names of all prisoners who were held at St Helena Penal Establishment,http://www.archivessearch.qld.gov.au/Search/ItemDetails.aspx?ItemId=341020,
ABRAHAMSON,,or Ernest William LOVELOCK,5077,1887,1907,280,A/18577,ITM271423,DR69458,https://www.archivessearch.qld.gov.au/api/download_file/DR69458,S15403,Z2040,St Helena prisoners 1863-1936,Names of all prisoners who were held at St Helena Penal Establishment,http://www.archivessearch.qld.gov.au/Search/ItemDetails.aspx?ItemId=271423,
ABRIL,Paul E,or Abry BERTANI or Paul OBVILLE,4942,1887,1907,145,A/18577,ITM271423,DR69457,https://www.archivessearch.qld.gov.au/api/download_file/DR69457,S15403,Z2040,St Helena prisoners 1863-1936,Names of all prisoners who were held at St Helena Penal Establishment,http://www.archivessearch.qld.gov.au/Search/ItemDetails.aspx?ItemId=271423,
ACKERY,Jacob,,600,1936,1936,214,A/18565,ITM341020,DR60496,https://www.archivessearch.qld.gov.au/api/download_file/DR60496,S10832,87111,St Helena prisoners 1863-1936,Names of all prisoners who were held at St Helena Penal Establishment,http://www.archivessearch.qld.gov.au/Search/ItemDetails.aspx?ItemId=341020,
ACTON,Charles Henry,,4064,1879,1895,454,PRI2/7,ITM92277,DR69473,https://www.archivessearch.qld.gov.au/api/download_file/DR69473,S15403,Z2039,St Helena prisoners 1863-1936,Names of all prisoners who were held at St Helena Penal Establishment,http://www.archivessearch.qld.gov.au/Search/ItemDetails.aspx?ItemId=92277,
ADAMS,Francis Leslie,,589,1936,1936,214,A/18565,ITM341020,DR60496,https://www.archivessearch.qld.gov.au/api/download_file/DR60496,S10832,87111,St Helena prisoners 1863-1936,Names of all prisoners who were held at St Helena Penal Establishment,http://www.archivessearch.qld.gov.au/Search/ItemDetails.aspx?ItemId=341020,
ADAMS,Francis Lislie,,201,1935,1935,65,A/18565,ITM341020,DR60488,https://www.archivessearch.qld.gov.au/api/download_file/DR60488,S10832,87111,St Helena prisoners 1863-1936,Names of all prisoners who were held at St Helena Penal Establishment,http://www.archivessearch.qld.gov.au/Search/ItemDetails.aspx?ItemId=341020,
ADAMS,George,,562,1936,1936,211,A/18565,ITM341020,DR60496,https://www.archivessearch.qld.gov.au/api/download_file/DR60496,S10832,87111,St Helena prisoners 1863-1936,Names of all prisoners who were held at St Helena Penal Establishment,http://www.archivessearch.qld.gov.au/Search/ItemDetails.aspx?ItemId=341020,
ADAMS,George,,635,1936,1936,217,A/18565,ITM341020,DR60496,https://www.archivessearch.qld.gov.au/api/download_file/DR60496,S10832,87111,St Helena prisoners 1863-1936,Names of all prisoners who were held at St Helena Penal Establishment,http://www.archivessearch.qld.gov.au/Search/ItemDetails.aspx?ItemId=341020,
ADAMS,George,,784,1935,1935,114,A/18565,ITM341020,DR60491,https://www.archivessearch.qld.gov.au/api/download_file/DR60491,S10832,87111,St Helena prisoners 1863-1936,Names of all prisoners who were held at St Helena Penal Establishment,http://www.archivessearch.qld.gov.au/Search/ItemDetails.aspx?ItemId=341020,
ADAMS,George C ,,814,1863,1867,57,PRI2/9,ITM92280,DR56516,https://www.archivessearch.qld.gov.au/api/download_file/DR56516,S15398,Z2040,St Helena prisoners 1863-1936,Names of all prisoners who were held at St Helena Penal Establishment,http://www.archivessearch.qld.gov.au/Search/ItemDetails.aspx?ItemId=92280,
ADAMS,James,,885,1935,1935,122,A/18565,ITM341020,DR60491,https://www.archivessearch.qld.gov.au/api/download_file/DR60491,S10832,87111,St Helena prisoners 1863-1936,Names of all prisoners who were held at St Helena Penal Establishment,http://www.archivessearch.qld.gov.au/Search/ItemDetails.aspx?ItemId=341020,
ADAMS,John,,14,1863,1867,1,PRI2/9,ITM92279,DR56513,https://www.archivessearch.qld.gov.au/api/download_file/DR56513,S15398,Z2040,St Helena prisoners 1863-1936,Names of all prisoners who were held at St Helena Penal Establishment,http://www.archivessearch.qld.gov.au/Search/ItemDetails.aspx?ItemId=92279,
ADAMS,John,,5317,1887,1907,521,A/18577,ITM271423,DR69559,https://www.archivessearch.qld.gov.au/api/download_file/DR69459,S15403,Z2040,St Helena prisoners 1863-1936,Names of all prisoners who were held at St Helena Penal Establishment,http://www.archivessearch.qld.gov.au/Search/ItemDetails.aspx?ItemId=271423,
ADAMS,Matthew,,4950,1887,1907,153,A/18577,ITM271423,DR69457,https://www.archivessearch.qld.gov.au/api/download_file/DR69457,S15403,Z2040,St Helena prisoners 1863-1936,Names of all prisoners who were held at St Helena Penal Establishment,http://www.archivessearch.qld.gov.au/Search/ItemDetails.aspx?ItemId=271423,
ADAMS,Thomas,,836,1863,1867,58,PRI2/9,ITM92280,DR56516,https://www.archivessearch.qld.gov.au/api/download_file/DR56516,S15398,Z2040,St Helena prisoners 1863-1936,Names of all prisoners who were held at St Helena Penal Establishment,http://www.archivessearch.qld.gov.au/Search/ItemDetails.aspx?ItemId=92280,
ADAMS,Thomas,,1118,1934,1934,35,A/18565,ITM341020,DR60488,https://www.archivessearch.qld.gov.au/api/download_file/DR60488,S10832,87111,St Helena prisoners 1863-1936,Names of all prisoners who were held at St Helena Penal Establishment,http://www.archivessearch.qld.gov.au/Search/ItemDetails.aspx?ItemId=341020,
ADAMS,Thomas,or HUGHES,1380,1863,1867,88,PRI2/9,ITM92280,DR56517,https://www.archivessearch.qld.gov.au/api/download_file/DR56517,S15398,Z2040,St Helena prisoners 1863-1936,Names of all prisoners who were held at St Helena Penal Establishment,http://www.archivessearch.qld.gov.au/Search/ItemDetails.aspx?ItemId=92280,
ADAMS,Thomas,,1641,1863,1867,103,PRI2/9,ITM92280,DR56517,https://www.archivessearch.qld.gov.au/api/download_file/DR56517,S15398,Z2040,St Helena prisoners 1863-1936,Names of all prisoners who were held at St Helena Penal Establishment,http://www.archivessearch.qld.gov.au/Search/ItemDetails.aspx?ItemId=92280,
ADAMS,Thomas,,1881,1863,1867,116,PRI2/9,ITM92280,DR56517,https://www.archivessearch.qld.gov.au/api/download_file/DR56517,S15398,Z2040,St Helena prisoners 1863-1936,Names of all prisoners who were held at St Helena Penal Establishment,http://www.archivessearch.qld.gov.au/Search/ItemDetails.aspx?ItemId=92280,
ADAMS,Thomas,,4735,1895,1900,526,PRI2/8,ITM92278,DR64930,https://www.archivessearch.qld.gov.au/api/download_file/DR64930,S15403,Z2040,St Helena prisoners 1863-1936,Names of all prisoners who were held at St Helena Penal Establishment,http://www.archivessearch.qld.gov.au/Search/ItemDetails.aspx?ItemId=92278,
ADAMS,William,,169,1936,1936,179,A/18565,ITM341020,DR60496,https://www.archivessearch.qld.gov.au/api/download_file/DR60496,S10832,87111,St Helena prisoners 1863-1936,Names of all prisoners who were held at St Helena Penal Establishment,http://www.archivessearch.qld.gov.au/Search/ItemDetails.aspx?ItemId=341020,
ADAMS,William,,237,1936,1936,184,A/18565,ITM341020,DR60496,https://www.archivessearch.qld.gov.au/api/download_file/DR60496,S10832,87111,St Helena prisoners 1863-1936,Names of all prisoners who were held at St Helena Penal Establishment,http://www.archivessearch.qld.gov.au/Search/ItemDetails.aspx?ItemId=341020,
ADAMS,William,,337,1863,1867,30,PRI2/9,ITM92280,DR56516,https://www.archivessearch.qld.gov.au/api/download_file/DR56516,S15398,Z2040,St Helena prisoners 1863-1936,Names of all prisoners who were held at St Helena Penal Establishment,http://www.archivessearch.qld.gov.au/Search/ItemDetails.aspx?ItemId=92280,
ADAMS,William,,340,1936,1936,193,A/18565,ITM341020,DR60496,https://www.archivessearch.qld.gov.au/api/download_file/DR60496,S10832,87111,St Helena prisoners 1863-1936,Names of all prisoners who were held at St Helena Penal Establishment,http://www.archivessearch.qld.gov.au/Search/ItemDetails.aspx?ItemId=341020,
ADAMS,William,,464,1936,1936,203,A/18565,ITM341020,DR60496,https://www.archivessearch.qld.gov.au/api/download_file/DR60496,S10832,87111,St Helena prisoners 1863-1936,Names of all prisoners who were held at St Helena Penal Establishment,http://www.archivessearch.qld.gov.au/Search/ItemDetails.aspx?ItemId=341020,
ADAMS,William,,792,1936,1936,230,A/18565,ITM341020,DR60496,https://www.archivessearch.qld.gov.au/api/download_file/DR60496,S10832,87111,St Helena prisoners 1863-1936,Names of all prisoners who were held at St Helena Penal Establishment,http://www.archivessearch.qld.gov.au/Search/ItemDetails.aspx?ItemId=341020,
ADAMS,William,,838,1863,1867,30,PRI2/9,ITM92280,DR56516,https://www.archivessearch.qld.gov.au/api/download_file/DR56516,S15398,Z2040,St Helena prisoners 1863-1936,Names of all prisoners who were held at St Helena Penal Establishment,http://www.archivessearch.qld.gov.au/Search/ItemDetails.aspx?ItemId=92280,
ADAMS,William,,929,1936,1936,242,A/18565,ITM341020,DR60496,https://www.archivessearch.qld.gov.au/api/download_file/DR60496,S10832,87111,St Helena prisoners 1863-1936,Names of all prisoners who were held at St Helena Penal Establishment,http://www.archivessearch.qld.gov.au/Search/ItemDetails.aspx?ItemId=341020,
ADAMS,,or William EVANS,2068,1863,1867,126,PRI2/9,ITM92280,DR56517,https://www.archivessearch.qld.gov.au/api/download_file/DR56517,S15398,Z2040,St Helena prisoners 1863-1936,Names of all prisoners who were held at St Helena Penal Establishment,http://www.archivessearch.qld.gov.au/Search/ItemDetails.aspx?ItemId=92280,
ADAMSON,Arthur Percy,or Leslie HENDERSON or McKELL,4999,1887,1907,202,A/18577,ITM271423,DR69457,https://www.archivessearch.qld.gov.au/api/download_file/DR69457,S15403,Z2040,St Helena prisoners 1863-1936,Names of all prisoners who were held at St Helena Penal Establishment,http://www.archivessearch.qld.gov.au/Search/ItemDetails.aspx?ItemId=271423,
ADAMSON,Frederick,,4926,1887,1907,129,A/18577,ITM271423,DR69457,https://www.archivessearch.qld.gov.au/api/download_file/DR69457,S15403,Z2040,St Helena prisoners 1863-1936,Names of all prisoners who were held at St Helena Penal Establishment,http://www.archivessearch.qld.gov.au/Search/ItemDetails.aspx?ItemId=271423,
ADAMSON,William,,877,1863,1867,60,PRI2/9,ITM92280,DR56516,https://www.archivessearch.qld.gov.au/api/download_file/DR56516,S15398,Z2040,St Helena prisoners 1863-1936,Names of all prisoners who were held at St Helena Penal Establishment,http://www.archivessearch.qld.gov.au/Search/ItemDetails.aspx?ItemId=92280,
ADAMSON,William,,1214,1935,1935,150,A/18565,ITM341020,DR60491,https://www.archivessearch.qld.gov.au/api/download_file/DR60491,S10832,87111,St Helena prisoners 1863-1936,Names of all prisoners who were held at St Helena Penal Establishment,http://www.archivessearch.qld.gov.au/Search/ItemDetails.aspx?ItemId=341020,
ADAMSON,William,,1394,1863,1867,89,PRI2/9,ITM92280,DR56517,https://www.archivessearch.qld.gov.au/api/download_file/DR56517,S15398,Z2040,St Helena prisoners 1863-1936,Names of all prisoners who were held at St Helena Penal Establishment,http://www.archivessearch.qld.gov.au/Search/ItemDetails.aspx?ItemId=92280,
ADAMSON,William,,1817,1863,1867,112,PRI2/9,ITM92280,DR56517,https://www.archivessearch.qld.gov.au/api/download_file/DR56517,S15398,Z2040,St Helena prisoners 1863-1936,Names of all prisoners who were held at St Helena Penal Establishment,http://www.archivessearch.qld.gov.au/Search/ItemDetails.aspx?ItemId=92280,
ADAMSON,,or George SHIELDS,5631,1887,1907,565,A/18577,ITM271423,DR69559,https://www.archivessearch.qld.gov.au/api/download_file/DR69459,S15403,Z2040,St Helena prisoners 1863-1936,Names of all prisoners who were held at St Helena Penal Establishment,http://www.archivessearch.qld.gov.au/Search/ItemDetails.aspx?ItemId=271423,
ADCOCK,Leonard John,,759,1934,1934,5,A/18565,ITM341020,DR60488,https://www.archivessearch.qld.gov.au/api/download_file/DR60488,S10832,87111,St Helena prisoners 1863-1936,Names of all prisoners who were held at St Helena Penal Establishment,http://www.archivessearch.qld.gov.au/Search/ItemDetails.aspx?ItemId=341020,
ADMUNDSEN,Tollef Pils Harwck,,36,1935,1935,50,A/18565,ITM341020,DR60488,https://www.archivessearch.qld.gov.au/api/download_file/DR60488,S10832,87111,St Helena prisoners 1863-1936,Names of all prisoners who were held at St Helena Penal Establishment,http://www.archivessearch.qld.gov.au/Search/ItemDetails.aspx?ItemId=341020,
ADSETT,Allen Ambrose,,44,1935,1935,51,A/18565,ITM341020,DR60488,https://www.archivessearch.qld.gov.au/api/download_file/DR60488,S10832,87111,St Helena prisoners 1863-1936,Names of all prisoners who were held at St Helena Penal Establishment,http://www.archivessearch.qld.gov.au/Search/ItemDetails.aspx?ItemId=341020,
AGNEW,John Vincent,,4768,1895,1900,559,PRI2/8,ITM92278,DR64930,https://www.archivessearch.qld.gov.au/api/download_file/DR64930,S15403,Z2040,St Helena prisoners 1863-1936,Names of all prisoners who were held at St Helena Penal Establishment,http://www.archivessearch.qld.gov.au/Search/ItemDetails.aspx?ItemId=92278,
AH BOW,,,488,1863,1867,39,PRI2/9,ITM92280,DR56516,https://www.archivessearch.qld.gov.au/api/download_file/DR56516,S15398,Z2040,St Helena prisoners 1863-1936,Names of all prisoners who were held at St Helena Penal Establishment,http://www.archivessearch.qld.gov.au/Search/ItemDetails.aspx?ItemId=92280,
AH CHEW,,,216,1863,1867,24,PRI2/9,ITM92280,DR56516,https://www.archivessearch.qld.gov.au/api/download_file/DR56516,S15398,Z2040,St Helena prisoners 1863-1936,Names of all prisoners who were held at St Helena Penal Establishment,http://www.archivessearch.qld.gov.au/Search/ItemDetails.aspx?ItemId=92280,
AH CHEW,,,717,1863,1867,24,PRI2/9,ITM92280,DR56516,https://www.archivessearch.qld.gov.au/api/download_file/DR56516,S15398,Z2040,St Helena prisoners 1863-1936,Names of all prisoners who were held at St Helena Penal Establishment,http://www.archivessearch.qld.gov.au/Search/ItemDetails.aspx?ItemId=92280,
AH CHONG,,,1844,1863,1867,114,PRI2/9,ITM92280,DR56517,https://www.archivessearch.qld.gov.au/api/download_file/DR56517,S15398,Z2040,St Helena prisoners 1863-1936,Names of all prisoners who were held at St Helena Penal Establishment,http://www.archivessearch.qld.gov.au/Search/ItemDetails.aspx?ItemId=92280,
AH CHONG,,,1869,1863,1867,115,PRI2/9,ITM92280,DR56517,https://www.archivessearch.qld.gov.au/api/download_file/DR56517,S15398,Z2040,St Helena prisoners 1863-1936,Names of all prisoners who were held at St Helena Penal Establishment,http://www.archivessearch.qld.gov.au/Search/ItemDetails.aspx?ItemId=92280,
AH CHOW,Willie,,5354,1887,1907,558,A/18577,ITM271423,DR69559,https://www.archivessearch.qld.gov.au/api/download_file/DR69459,S15403,Z2040,St Helena prisoners 1863-1936,Names of all prisoners who were held at St Helena Penal Establishment,http://www.archivessearch.qld.gov.au/Search/ItemDetails.aspx?ItemId=271423,
AH CHUCK,,or Tommy AH KING,4866,1887,1907,69,A/18577,ITM271423,DR69457,https://www.archivessearch.qld.gov.au/api/download_file/DR69457,S15403,Z2040,St Helena prisoners 1863-1936,Names of all prisoners who were held at St Helena Penal Establishment,http://www.archivessearch.qld.gov.au/Search/ItemDetails.aspx?ItemId=271423,
AH CHUNG,,,1145,1863,1867,75,PRI2/9,ITM92280,DR56516,https://www.archivessearch.qld.gov.au/api/download_file/DR56516,S15398,Z2040,St Helena prisoners 1863-1936,Names of all prisoners who were held at St Helena Penal Establishment,http://www.archivessearch.qld.gov.au/Search/ItemDetails.aspx?ItemId=92280,
AH FAT,,,1501,1863,1867,95,PRI2/9,ITM92280,DR56517,https://www.archivessearch.qld.gov.au/api/download_file/DR56517,S15398,Z2040,St Helena prisoners 1863-1936,Names of all prisoners who were held at St Helena Penal Establishment,http://www.archivessearch.qld.gov.au/Search/ItemDetails.aspx?ItemId=92280,
AH FAT,,or AH FOY,3777,1879,1895,175,PRI2/7,ITM92277,DR69471,https://www.archivessearch.qld.gov.au/api/download_file/DR69471,S15403,Z2039,St Helena prisoners 1863-1936,Names of all prisoners who were held at St Helena Penal Establishment,http://www.archivessearch.qld.gov.au/Search/ItemDetails.aspx?ItemId=92277,
AH FAT,,,3985,1879,1895,375,PRI2/7,ITM92277,DR69472,https://www.archivessearch.qld.gov.au/api/download_file/DR69472,S15403,Z2039,St Helena prisoners 1863-1936,Names of all prisoners who were held at St Helena Penal Establishment,http://www.archivessearch.qld.gov.au/Search/ItemDetails.aspx?ItemId=92277,
AH FAT,,or MOW KEE or GEORGIE,4560,1895,1900,351,PRI2/8,ITM92278,DR64930,https://www.archivessearch.qld.gov.au/api/download_file/DR64930,S15403,Z2039,St Helena prisoners 1863-1936,Names of all prisoners who were held at St Helena Penal Establishment,http://www.archivessearch.qld.gov.au/Search/ItemDetails.aspx?ItemId=92278,
AH FOO,,or DUE GEE,4357,1895,1900,145,PRI2/8,ITM92278,DR23440,https://www.archivessearch.qld.gov.au/api/download_file/DR23440,S15403,Z2039,St Helena prisoners 1863-1936,Names of all prisoners who were held at St Helena Penal Establishment,http://www.archivessearch.qld.gov.au/Search/ItemDetails.aspx?ItemId=92278,
AH FOO,,or DEE GEE,4413,1895,1900,204,PRI2/8,ITM92278,DR23440,https://www.archivessearch.qld.gov.au/api/download_file/DR23440,S15403,Z2039,St Helena prisoners 1863-1936,Names of all prisoners who were held at St Helena Penal Establishment,http://www.archivessearch.qld.gov.au/Search/ItemDetails.aspx?ItemId=92278,
AH FOO,,or DU GEE,4833,1887,1907,36,A/18577,ITM271423,DR69457,https://www.archivessearch.qld.gov.au/api/download_file/DR69457,S15403,Z2040,St Helena prisoners 1863-1936,Names of all prisoners who were held at St Helena Penal Establishment,http://www.archivessearch.qld.gov.au/Search/ItemDetails.aspx?ItemId=271423,
AH FOY,,or AH FAT or GEORGIE,3777,1879,1895,175,PRI2/7,ITM92277,DR69471,https://www.archivessearch.qld.gov.au/api/download_file/DR69471,S15403,Z2039,St Helena prisoners 1863-1936,Names of all prisoners who were held at St Helena Penal Establishment,http://www.archivessearch.qld.gov.au/Search/ItemDetails.aspx?ItemId=92277,
AH FUN,Thomas,or Thomas WILLIAMS,5336,1887,1907,540,A/18577,ITM271423,DR69559,https://www.archivessearch.qld.gov.au/api/download_file/DR69459,S15403,Z2040,St Helena prisoners 1863-1936,Names of all prisoners who were held at St Helena Penal Establishment,http://www.archivessearch.qld.gov.au/Search/ItemDetails.aspx?ItemId=271423,
AH GEE,,,5155,1887,1907,358,A/18577,ITM271423,DR69458,https://www.archivessearch.qld.gov.au/api/download_file/DR69458,S15403,Z2040,St Helena prisoners 1863-1936,Names of all prisoners who were held at St Helena Penal Establishment,http://www.archivessearch.qld.gov.au/Search/ItemDetails.aspx?ItemId=271423,
AH GOON,,,1870,1863,1867,115,PRI2/9,ITM92280,DR56517,https://www.archivessearch.qld.gov.au/api/download_file/DR56517,S15398,Z2040,St Helena prisoners 1863-1936,Names of all prisoners who were held at St Helena Penal Establishment,http://www.archivessearch.qld.gov.au/Search/ItemDetails.aspx?ItemId=92280,
AH GOON,,,3329,1879,1895,28,PRI2/7,ITM92277,DR69471,https://www.archivessearch.qld.gov.au/api/download_file/DR69471,S15403,Z2039,St Helena prisoners 1863-1936,Names of all prisoners who were held at St Helena Penal Establishment,http://www.archivessearch.qld.gov.au/Search/ItemDetails.aspx?ItemId=92277,
AH GOW,,,4165,1879,1895,555,PRI2/7,ITM92277,DR69473,https://www.archivessearch.qld.gov.au/api/download_file/DR69473,S15403,Z2039,St Helena prisoners 1863-1936,Names of all prisoners who were held at St Helena Penal Establishment,http://www.archivessearch.qld.gov.au/Search/ItemDetails.aspx?ItemId=92277,
AH HAW,,,5160,1887,1907,363,A/18577,ITM271423,DR69458,https://www.archivessearch.qld.gov.au/api/download_file/DR69458,S15403,Z2040,St Helena prisoners 1863-1936,Names of all prisoners who were held at St Helena Penal Establishment,http://www.archivessearch.qld.gov.au/Search/ItemDetails.aspx?ItemId=271423,
AH HEW,,,490,1863,1867,14,PRI2/9,ITM92280,DR56516,https://www.archivessearch.qld.gov.au/api/download_file/DR56516,S15398,Z2040,St Helena prisoners 1863-1936,Names of all prisoners who were held at St Helena Penal Establishment,http://www.archivessearch.qld.gov.au/Search/ItemDetails.aspx?ItemId=92280,
AH HING,,or AH SAM,4582,1895,1900,373,PRI2/8,ITM92278,DR64930,https://www.archivessearch.qld.gov.au/api/download_file/DR64930,S15403,Z2039,St Helena prisoners 1863-1936,Names of all prisoners who were held at St Helena Penal Establishment,http://www.archivessearch.qld.gov.au/Search/ItemDetails.aspx?ItemId=92278,